{"text_format":"1","workbook":"xlsx","n_sheets":8,"sheets":["RAPPORT","Invulscherm 1 - Weging","Invulscherm 1b","Invulscherm 2 - Scores","BRONNEN","Blad2","Criteria-Status-Tabel","Blad1"],"not_rendered":{"charts":0,"images":3,"macros":1,"external_links":0,"defined_names":13,"comments":3,"pivot_tables":0},"unopened":[],"bounds":{"document_bytes":16777216,"sheet_cells":100000,"rows_first":2000,"rows_last":500,"rows_between":2000,"halvings":0,"cell_chars":16384,"cell_head_chars":4096},"cells_cut":0,"cells_raw":0,"read":"whole","date_system":"1900"}

{"sheet":"RAPPORT","index":0,"n_rows":106,"n_cols":19,"rows_kept":106,"cut":false,"hidden":false,"merged":[[35,20,36,20],[31,15,31,19],[31,2,31,4],[31,6,31,8],[34,2,34,10],[34,18,34,20],[33,14,33,16],[33,17,33,19],[50,20,51,20],[47,20,48,20],[44,20,45,20],[38,20,39,20],[41,20,42,20],[47,8,48,8],[47,11,48,13],[47,14,48,19],[41,2,42,6],[41,8,42,8],[41,11,42,13],[41,14,42,19],[8,2,8,10],[8,18,8,20],[9,15,9,16],[9,18,9,19],[11,6,12,6],[11,8,12,8],[10,2,10,10],[10,18,10,20],[11,20,12,20],[9,11,9,14],[14,6,15,6],[14,8,15,8],[17,6,18,6],[17,8,18,8],[14,15,15,16],[17,15,18,16],[23,6,24,6],[23,8,24,8],[26,6,27,6],[26,8,27,8],[29,18,29,19],[11,11,12,13],[14,11,15,13],[17,11,18,13],[20,11,21,13],[23,11,24,13],[11,15,12,16],[11,18,12,19],[20,15,21,16],[20,18,21,19],[23,15,24,16],[23,18,24,19],[29,15,29,16],[14,18,15,19],[26,11,27,13],[26,15,27,16],[17,18,18,19],[26,18,27,19],[5,2,5,10],[5,18,5,20],[50,2,51,6],[50,8,51,8],[50,11,51,13],[44,2,45,6],[44,8,45,8],[44,11,45,13],[35,2,36,6],[33,11,33,13],[33,2,33,10],[29,2,29,8],[20,6,21,6],[20,8,21,8],[35,8,36,8],[35,11,36,13],[35,14,36,19],[38,2,39,6],[38,8,39,8],[38,11,39,13],[38,14,39,19],[44,14,45,19],[50,14,51,19],[47,2,48,6],[101,4,101,19],[102,4,102,19],[66,2,66,19],[67,2,67,10],[67,18,67,20],[68,2,69,19],[68,20,69,20],[74,2,75,19],[80,2,81,19],[86,2,87,19],[92,2,93,19],[98,2,99,19],[98,20,99,20],[70,4,70,19],[71,4,71,19],[72,4,72,19],[76,4,76,19],[77,4,77,19],[78,4,78,19],[82,4,82,19],[83,4,83,19],[84,4,84,19],[56,2,57,19],[65,2,65,20],[88,4,88,19],[89,4,89,19],[90,4,90,19],[94,4,94,19],[95,4,95,19],[96,4,96,19],[100,4,100,19]]}
[]
[null,null,"Projectnaam:",null,null,null,"(invullen…)"]
[null,null,"Locatie site:",null,null,null,"(invullen…)"]
[null,null,"Assessor:",null,null,null,"(invullen…)"]
[null,null,"Datum:",null,null,null,"(invullen…)"]
[]
[null,null,"Voorbereidingsfase (%)",null,"Ontwerpfase (%)",null,"Categoriescore (%)",null,"Controle uigevoerd?"]
[null,null,"fase 1",null,"fase 2",null,"fase 2",null,"fase 3",null,"thema's"]
[]
[null,null,null,null,null,null,null,null,null,null,"TYPE:",{"$f":"'Invulscherm 1 - Weging'!F3","v":"PRODUCTIEGERICHT & GEMENGD BEDRIJVENTERREIN"},null,null,null,"WEGING (%)",null,null,"SCORE (%)"]
{"$rows_left_out":97}
{"sheet":"Invulscherm 1 - Weging","index":1,"n_rows":125,"n_cols":23,"rows_kept":125,"cut":false,"hidden":false,"merged":[[57,9,58,9],[57,0,58,0],[57,1,58,2],[57,3,57,8],[29,0,30,0],[29,1,30,2],[29,9,30,9],[29,3,29,8],[44,3,44,8],[87,9,102,9],[2,0,2,1],[3,0,3,1],[59,9,67,9],[3,3,3,5],[3,6,3,8],[2,3,2,4],[70,9,81,9],[5,3,5,8],[5,0,6,0],[5,1,6,2],[5,9,6,9],[44,0,45,0],[68,0,69,0],[44,1,45,2],[44,9,45,9],[68,1,69,2],[68,3,68,8],[68,9,69,9],[85,0,86,0],[85,1,86,2],[85,3,85,8],[85,9,86,9]]}
[]
[null,null,null,null,null,null,null,null,{"$f":"IF(S15=1,\"Nieuw Terrein\",\"Bestaand Terrein\")","v":"Nieuw Terrein"}]
["Maak keuze:",null,null,null,null,{"$f":"IF(S14=1,\"PRODUCTIEGERICHT & GEMENGD BEDRIJVENTERREIN\",IF(S14=2,\"KANTOOR TERREIN\",IF(S14=3,\"VRIJETIJDSGERICHT BEDRIJVENTERREIN\",IF(S14=4,\"LOGISTIEK TERREIN\"))))","v":"PRODUCTIEGERICHT & GEMENGD BEDRIJVENTERREIN"},null,null,{"$f":"IF(S15=1,\"(nieuw)\",\"(bestaand)\")","v":"(nieuw)"},null,null,null,null,"Bestaande Sites Certificaat"]
["Maak keuze:",null,null,"1-Voorbereidingsfase",null,null,"2-Ontwerpfase",null,null,"Categorie weging",null,null,null,"Checklist Bestaande Sites"]
[null,null,null,"Geef accent","Status","Weging","Geef accent","Status","Weging",null,null,null,null,"Weging",null,null,null,null,null,null,"Beschikbaar","Beschikbaar"]
["MAN","1. MANAGEMENT (20%)",null,{"$f":"IF(SUM(Q9:R29)=0,\"U heeft nog geen wijzigingen in dit thema doorgevoerd\",IF(SUM(Q9:R29)=1,\"Let op! U kunt nog 2 wijziging binnen dit thema doorvoeren\",IF(SUM(Q9:R29)=2,\"Let op! U kunt nog 1 wijziging voor dit thema doorvoeren\",IF(SUM(Q9:R29)=3,\"LET OP! U mag geen wijzigingen meer doorvoeren binnen dit thema\",\"STOP! U heeft te veel wijzigingen doorgevoerd. Klik op de knop 'basiswaarden' om te resetten\"))))","v":"U heeft nog geen wijzigingen in dit thema doorgevoerd"},null,null,null,null,null,{"$f":"SUM(I7+F7)","v":20.000000000000004}]
[null,null,null,null,null,{"$f":"SUM(F9:F23)","v":9.2000000000000011},null,null,{"$f":"SUM(I12:I29)","v":10.800000000000002},null,null,null,null,null,null,null,null,null,"1 - Productiegericht & gemengd bedrijventerrein"," (i.e. traditionele transport en distributie, industrie, afvalverwerking, recycling)",11,9]
["MAN1","Markt",null,null,null,null,null,null,null,null,null,null,null,null,null,null,null,null,"2 - Kantoor terrein"," (i.e. kantoren- en dienstenzones, kantoren publieksgericht)"]
["MAN1.1",null,"Marktanalyse (marktvraag & welke eisen stelt markt aan de locatie)",null,{"$f":"IF(K9=1,\"minder belangrijk\",IF(K9=2,\"relevant\",IF(K9=3,\"extra belangrijk\")))","v":"extra belangrijk"},{"$f":"IF(K9=1,U9,IF(K9=2,U9*2,IF(K9=3,U9*3)))","v":1.2000000000000002},null,null,null,null,{"$f":"IFERROR(IF(OR(INDEX('Criteria-Status-Tabel'!$A$5:$K$128,MATCH(\"1-\"&'Invulscherm 1 - Weging'!$A9,'Criteria-Status-Tabel'!$A$5:$A$128,0),MATCH(10*$S$15+$S$14,'Criteria-Status-Tabel'!$A$5:$K$5,0))=\"relevant\",INDEX('Criteria-Status-Tabel'!$A$5:$K$128,MATCH(\"1-\"&'Invulscherm 1 - Weging'!$A9,'Criteria-Status-Tabel'!$A$5:$A$128,0),MATCH(10*$S$15+$S$14,'Criteria-Status-Tabel'!$A$5:$K$5,0))=\"verplicht\")=TRUE,2,IF(INDEX('Criteria-Status-Tabel'!$A$5:$K$128,MATCH(\"1-\"&'Invulscherm 1 - Weging'!$A9,'Criteria-Status-Tabel'!$A$5:$A$128,0),MATCH(10*$S$15+$S$14,'Criteria-Status-Tabel'!$A$5:$K$5,0))=\"extra belangrijk\",3,1)),\"1\")","v":3},null,null,null,{"$f":"IFERROR(IF(OR(INDEX('Criteria-Status-Tabel'!$A$5:$K$128,MATCH(\"1-\"&'Invulscherm 1 - Weging'!$A9,'Criteria-Status-Tabel'!$A$5:$A$128,0),MATCH(10*$S$15+$S$14,'Criteria-Status-Tabel'!$A$5:$K$5,0))=\"relevant\",INDEX('Criteria-Status-Tabel'!$A$5:$K$128,MATCH(\"1-\"&'Invulscherm 1 - Weging'!$A9,'Criteria-Status-Tabel'!$A$5:$A$128,0),MATCH(10*$S$15+$S$14,'Criteria-Status-Tabel'!$A$5:$K$5,0))=\"verplicht\")=TRUE,2,IF(INDEX('Criteria-Status-Tabel'!$A$5:$K$128,MATCH(\"1-\"&'Invulscherm 1 - Weging'!$A9,'Criteria-Status-Tabel'!$A$5:$A$128,0),MATCH(10*$S$15+$S$14,'Criteria-Status-Tabel'!$A$5:$K$5,0))=\"extra belangrijk\",3,1)),\"1\")","v":3},null,{"$f":"IF(K9<>O9,1,0)","v":0},{"$f":"IF(L9<>P9,1,0)","v":0},"3 - Vrijetijdsgericht bedrijventerrein"," (i.e. kleinhandel, leisure (sportstadia, beurzen))",{"$f":"SUM($U$7+$V$7)/SUM($K$9:$L$29)","v":0.4},null,"Alleen uit bij 'bestaande terreinen'"]
["MAN1.2",null,"Effect marktanalyse op ruimtelijk ontwerp",null,{"$f":"IF(K10=1,\"minder belangrijk\",IF(K10=2,\"relevant\",IF(K10=3,\"extra belangrijk\")))","v":"extra belangrijk"},{"$f":"IF(K10=1,U10,IF(K10=2,U10*2,IF(K10=3,U10*3)))","v":1.2000000000000002},null,null,null,null,{"$f":"IFERROR(IF(OR(INDEX('Criteria-Status-Tabel'!$A$5:$K$128,MATCH(\"1-\"&'Invulscherm 1 - Weging'!$A10,'Criteria-Status-Tabel'!$A$5:$A$128,0),MATCH(10*$S$15+$S$14,'Criteria-Status-Tabel'!$A$5:$K$5,0))=\"relevant\",INDEX('Criteria-Status-Tabel'!$A$5:$K$128,MATCH(\"1-\"&'Invulscherm 1 - Weging'!$A10,'Criteria-Status-Tabel'!$A$5:$A$128,0),MATCH(10*$S$15+$S$14,'Criteria-Status-Tabel'!$A$5:$K$5,0))=\"verplicht\")=TRUE,2,IF(INDEX('Criteria-Status-Tabel'!$A$5:$K$128,MATCH(\"1-\"&'Invulscherm 1 - Weging'!$A10,'Criteria-Status-Tabel'!$A$5:$A$128,0),MATCH(10*$S$15+$S$14,'Criteria-Status-Tabel'!$A$5:$K$5,0))=\"extra belangrijk\",3,1)),\"1\")","v":3},null,null,null,{"$f":"IFERROR(IF(OR(INDEX('Criteria-Status-Tabel'!$A$5:$K$128,MATCH(\"1-\"&'Invulscherm 1 - Weging'!$A10,'Criteria-Status-Tabel'!$A$5:$A$128,0),MATCH(10*$S$15+$S$14,'Criteria-Status-Tabel'!$A$5:$K$5,0))=\"relevant\",INDEX('Criteria-Status-Tabel'!$A$5:$K$128,MATCH(\"1-\"&'Invulscherm 1 - Weging'!$A10,'Criteria-Status-Tabel'!$A$5:$A$128,0),MATCH(10*$S$15+$S$14,'Criteria-Status-Tabel'!$A$5:$K$5,0))=\"verplicht\")=TRUE,2,IF(INDEX('Criteria-Status-Tabel'!$A$5:$K$128,MATCH(\"1-\"&'Invulscherm 1 - Weging'!$A10,'Criteria-Status-Tabel'!$A$5:$A$128,0),MATCH(10*$S$15+$S$14,'Criteria-Status-Tabel'!$A$5:$K$5,0))=\"extra belangrijk\",3,1)),\"1\")","v":3},null,0,0,"4 - Logistiek terrein"," (Standaar weging - geen eenduidig profiel)",{"$f":"SUM($U$7+$V$7)/SUM($K$9:$L$29)","v":0.4},null,"Alleen uit bij 'bestaande terreinen'"]
{"$rows_left_out":116}
{"sheet":"Invulscherm 1b","index":2,"n_rows":40,"n_cols":12,"rows_kept":40,"cut":false,"hidden":false,"merged":[[11,2,12,8],[17,2,18,10],[37,4,37,19],[38,4,38,19],[39,4,39,19],[13,4,13,19],[14,4,14,19],[15,4,15,19],[17,11,18,19],[11,11,12,19],[35,20,36,20],[19,4,19,19],[25,4,25,19],[26,4,26,19],[27,4,27,19],[31,4,31,19],[32,4,32,19],[33,4,33,19],[20,4,20,19],[21,4,21,19],[23,2,24,10],[29,2,30,10],[35,2,36,10],[35,11,36,19],[29,11,30,19],[23,11,24,19],[1,2,1,19],[3,2,3,16383],[7,4,7,19],[8,4,8,19],[9,4,9,19],[2,2,2,10],[2,18,2,20],[5,20,6,20],[5,2,6,6],[5,11,6,19]]}
[]
[null,null,"Toelichting op wijzigingen 'Invulscherm 1'"]
[]
[null,null,"Per thema kunnen maximaal 3 wijzigingen doorgevoerd worden. Indien in het 'invulblad 1' wijzigingen zijn aangebracht dan is het verplicht om hieronde een toelichting te geven. Wijzigingen (inclusief toelichting) worden afgekeurd bij certificering, als deze niet bijdragen aan het verduurzamen van de economische site / bedrijventerrein. "]
[]
[null,null,"1. MAN - MANAGEMENT",null,null,null,null,null,null,null,null,{"$f":"'Invulscherm 1 - Weging'!D6","v":"U heeft nog geen wijzigingen in dit thema doorgevoerd"}]
[]
[null,null,"Wijziging 1:",null,"(invullen…)"]
[null,null,"Wijziging 2:",null,"(invullen…)"]
[null,null,"Wijziging 3:",null,"(invullen…)"]
{"$rows_left_out":31}
{"sheet":"Invulscherm 2 - Scores","index":3,"n_rows":142,"n_cols":15,"rows_kept":142,"cut":false,"hidden":false,"merged":[[16,2,17,2],[70,2,71,2],[95,2,96,2],[95,1,96,1],[90,1,91,2],[80,1,81,2],[76,1,77,1],[76,2,77,2],[55,2,56,2],[48,2,49,2],[48,1,49,1],[50,2,51,2],[50,1,51,1],[64,1,65,1],[64,2,65,2],[66,1,67,1],[1,3,1,9],[40,1,41,1],[44,1,45,2],[68,2,69,2],[68,1,69,1],[10,2,11,2],[10,1,11,1],[1,0,1,2],[40,2,41,2],[13,1,14,1],[18,2,19,2],[18,1,19,1],[13,2,14,2],[53,1,54,1],[53,2,54,2],[55,1,56,1],[66,2,67,2],[99,1,100,1],[99,2,100,2],[83,1,84,1],[93,2,94,2],[93,1,94,1],[85,2,86,2],[85,1,86,1],[83,2,84,2],[87,1,88,1],[87,2,88,2],[73,1,74,2],[70,1,71,1],[116,2,117,2],[119,2,120,2],[121,2,122,2],[104,2,105,2],[106,2,107,2],[109,2,110,2],[112,2,113,2],[114,2,115,2]]}
[]
[null,null,null,null,null,null,null,null,null,null,"TOTAAL SCORE (%)"]
[null,null,null,"Status","criterium","TIP","weging","Aandacht aan besteed?","Check door een project medewerker","Categorie score"]
["MAN","1. MANAGEMENT (20%)",null,null,null,null,null,null,null,{"$f":"SUM(J6:J30)","v":0},{"$f":"J4","v":0}]
["MAN1","Markt"]
["1-MAN1.1",null,"Marktanalyse (marktvraag & welke eisen stelt markt aan de locatie)",{"$f":"'Invulscherm 1 - Weging'!E9","v":"extra belangrijk"},"1 - Er is een branche-analyse & marktanalyse uitgevoerd.\n2 - Deze marktanalyse is doorvertaald naar een marktstrategie/businessplan. Daarbij vindt er een concretisering van de financiële-, economische-, organisatorische- en juridische aspecten plaats in een strategisch businessplan.\n3 - Het type bedrijventerrein sluit aantoonbaar aan bij de marktvraag.","- Branche-analyse en marktanalyse (kan in één document).\n- Businessplan\n- Onderbouwing die aantoont dat de keuze voor het type bedrijventerrein aansluit bij de marktvraag (max 1x A4)",{"$f":"'Invulscherm 1 - Weging'!F9","v":1.2000000000000002},null,null,{"$f":"IF(O6=1,G6,0)","v":0},{"$f":"J6","v":0},0,0,{"$f":"IF(R6=1,J6,0)","v":0},0]
["1-MAN1.2",null,"Effect marktanalyse op ruimtelijk ontwerp",{"$f":"'Invulscherm 1 - Weging'!E10","v":"extra belangrijk"},"1 - Een impactstudie van de ten uitvoer gebrachte marktstrategie met betrekking tot het ontwerpproces.\n2 - Een impactstudie van de ten uitvoer gebrachte marktstrategie met betrekking tot de projectlocatie.","- impactstudie\n\n- impactstudie (aanvulling op criterium 1) \n",{"$f":"'Invulscherm 1 - Weging'!F10","v":1.2000000000000002},null,null,{"$f":"IF(O7=1,G7,0)","v":0},{"$f":"J7","v":0},0,0,{"$f":"IF(R7=1,J7,0)","v":0},0]
["1-MAN1.3",null,"Maatschappelijk kosten baten (MKBA)",{"$f":"'Invulscherm 1 - Weging'!E11","v":"extra belangrijk"},"1. Er is een inschatting van de kosten-baten gemaakt.\n2. De kosten-baten analyse is aantoonbaar doorvertaald in de voorbereidingsfase.","- Kosten-baten inschatting of berekening. \n- Onderbouwing die aantoont dat de kosten-baten analyse ook daadwerkelijk is verwerkt in de voorbereidingsfase (max 1x A4)",{"$f":"'Invulscherm 1 - Weging'!F11","v":1.2000000000000002},null,null,0,{"$f":"J8","v":0},0,0,0,0]
["2-MAN1.4",null,"Maatschappelijk Verantwoord Ondernemen (MVO)",{"$f":"'Invulscherm 1 - Weging'!H12","v":"relevant"},"1 - Bij het aantrekken van bedrijven worden partijen met een transparant en gecommuniceerd maatschappelijk programma (MVO) in lijn met de waarden van de ontwikkeling gestimuleerd.","- Er is een MVO-profiel opgesteld waar bedrijven aan moeten voldoen voor vestiging op het terrein. Dit profiel is opgesteld op basis van de richtlijnen als gepresenteerd door MVO Vlaanderen. ",{"$f":"'Invulscherm 1 - Weging'!I12","v":0.8},null,null,0,{"$f":"J9","v":0},0,0,0,0]
["MAN2","Proces",null,null,null,null,null,null,null,null,{"$f":"J10","v":0},0,0,null,0]
{"$rows_left_out":133}
{"sheet":"BRONNEN","index":4,"n_rows":76,"n_cols":11,"rows_kept":76,"cut":false,"hidden":true,"merged":[]}
[null,null,null,"1 - Voorbereidingsfase","2- Ontwerpfase","3 - CHECK - Realisatie"]
["1. Management",null,"MAN",null,null,null,"Koppeling met:","BREEAM Communities?","Afkorting BREEAM Communities","Aanvulling vereist (andere meters)?","Toelichting"]
["1.1 Markt",null,"MAN1"]
[null,"1.1.1 Marktanalyse (marktvraag & welke eisen stelt markt aan de locatie)","MAN1.1","DZM Gent 1.1.2 d",null,null,null,"nee","-","ja","Ontwikkelen op basis Blue Gate/Logistiek Park Moerdijk/Logistiek Park Schijns"]
[null,"1.1.2 Effect marktanalyse op ruimtelijk ontwerp","MAN1.2",null,null,null,null,"nee","-","ja","Ontwikkelen op basis Blue Gate/Logistiek Park Moerdijk/Logistiek Park Schijns"]
[null,"1.1.3 Duurzaamheidsambitie passend bij markt","MAN1.3",null,null,null,null,"nee","-","ja","Ontwikkelen op basis Blue Gate/Logistiek Park Moerdijk/Logistiek Park Schijns"]
[null,"1.1.4 MVO / CSR (duurzame bedrijfvoering)","MAN1.5","BREEAM-NL Geb MAN6","minder belangrijk","= minder belangrijk","relevant"]
["1.2 Procesaanpak",null,"MAN2","BREEAM-NL Geb MAN1 & MAN5, instr. DZM Scholenb. 1.1a & 1.1b, LNE Wijken BEH 02.01, DZM Gent 1.2 c"]
[null,"1.2.1 Gebiedsvisie & duurzaamheidsambitie","MAN2.1","LNE Wijken BEH 01.02","extra belangrijk","= extra belangrijk","verplicht",null,null,null,"Bij elke fase duurzaamheidsambitie meetbaar testen / communiceren"]
["1.3 Draagvlak / Stakeholder management",null,"MAN3"]
{"$rows_left_out":67}
{"sheet":"Blad2","index":5,"n_rows":44,"n_cols":9,"rows_kept":44,"cut":false,"hidden":true,"merged":[]}
["Consultatieplan",null,null,null,null,"Ja","Planfase","Nieuwbouw","Projectgrens"]
["Consultatie en marktbenadering",null,null,null,null,"Nee","Realisatiefase","Renovatie","Systeemgrens"]
["Beoordeling ontwerp",null,null,null,null,"Aangepast","Beide","In-use"]
[null,null,null,null,null,null,null,"Nieuwbouw & Renovatie"]
["Management van faciliteiten",null,null,null,null,null,null,"Alledrie"]
[]
["Economische impact"]
["Lokale demografische samenstelling",null,null,null,null,"Management"]
["Overstromingsrisico",null,null,null,null,"Sociaal en economisch welzijn"]
["Geluidshinder",null,null,null,null,"Bronnen en energie"]
{"$rows_left_out":35}
{"sheet":"Criteria-Status-Tabel","index":6,"n_rows":143,"n_cols":12,"rows_kept":143,"cut":false,"hidden":false,"merged":[[45,2,46,2],[2,7,2,10],[2,3,2,6],[19,1,20,1],[19,2,20,2],[41,1,42,1],[41,2,42,2],[17,2,18,2],[11,1,12,1],[11,2,12,2],[14,1,15,1],[14,2,15,2],[96,1,97,1],[96,2,97,2],[84,1,85,1],[84,2,85,2],[86,1,87,1],[86,2,87,2],[67,2,68,2],[51,1,52,1],[74,2,75,2],[81,2,82,2],[91,2,92,2],[51,2,52,2],[54,1,55,1],[54,2,55,2],[56,1,57,1],[56,2,57,2],[1,3,1,10],[88,1,89,1],[88,2,89,2],[94,1,95,1],[94,2,95,2],[65,1,66,1],[65,2,66,2],[77,1,78,1],[77,2,78,2],[69,1,70,1],[69,2,70,2],[71,1,72,1],[71,2,72,2],[67,1,68,1],[49,1,50,1],[49,2,50,2],[105,1,106,2],[107,1,108,2],[110,1,111,2],[100,1,101,1],[100,2,101,2],[113,1,114,2],[115,1,116,2],[117,1,118,2],[120,1,121,2],[122,1,123,2]]}
[]
[null,null,null,"Standaard Status"]
[null,null,null,"Nieuw terrein",null,null,null,"Bestaand terrein"]
[null,null,null,"Productiegericht / gemengd","Kantoor terrein","Vrijetijd terrein","Logistiek","Productiegericht / gemengd","Kantoor terrein","Vrijetijd terrein","Logistiek"]
["MAN","1. MANAGEMENT (20%)",null,11,12,13,14,21,22,23,24]
["MAN1","Markt"]
["1-MAN1.1",null,"Marktanalyse (marktvraag & welke eisen stelt markt aan de locatie)","extra belangrijk","extra belangrijk","extra belangrijk","extra belangrijk","relevant","relevant","relevant","relevant"]
["1-MAN1.2",null,"Effect marktanalyse op ruimtelijk ontwerp","extra belangrijk","extra belangrijk","extra belangrijk","extra belangrijk","relevant","relevant","relevant","relevant"]
["1-MAN1.3",null,"Maatschappelijk kosten baten (MKBA)","extra belangrijk","extra belangrijk","extra belangrijk","extra belangrijk","relevant","relevant","relevant","relevant"]
["2-MAN1.4",null,"Maatschappelijk Verantwoord Ondernemen (MVO)","relevant","relevant","relevant","relevant","relevant","relevant","relevant","relevant"]
{"$rows_left_out":134}
{"sheet":"Blad1","index":7,"n_rows":6,"n_cols":8,"rows_kept":6,"cut":false,"hidden":true,"merged":[]}
[]
[]
[]
[null,null,null,"= niet van toepassing (nvt)",null,null,"relevant","= relevant"]
[]
[null,null,null,"= extra belangrijk",null,null,"verplicht","= verplicht"]